Skip to main content
summaryrefslogtreecommitdiffstats
diff options
context:
space:
mode:
Diffstat (limited to 'org.eclipse.mylyn.bugzilla.tests/testdata/reports-stacktrace/40152.html')
-rw-r--r--org.eclipse.mylyn.bugzilla.tests/testdata/reports-stacktrace/40152.html1228
1 files changed, 1228 insertions, 0 deletions
diff --git a/org.eclipse.mylyn.bugzilla.tests/testdata/reports-stacktrace/40152.html b/org.eclipse.mylyn.bugzilla.tests/testdata/reports-stacktrace/40152.html
new file mode 100644
index 000000000..fb15d0fa8
--- /dev/null
+++ b/org.eclipse.mylyn.bugzilla.tests/testdata/reports-stacktrace/40152.html
@@ -0,0 +1,1228 @@
+<!DOCTYPE HTML PUBLIC "-//W3C//DTD HTML 4.0 Transitional//EN">
+<!-- saved from url=(0051)https://bugs.eclipse.org/bugs/show_bug.cgi?id=40152 -->
+<!-- 1.0@bugzilla.org --><!-- 1.0@bugzilla.org --><HTML><HEAD><TITLE>Bug 40152 - Junit tests fail on GTK</TITLE>
+<META http-equiv=Content-Type content="text/html; charset=iso-8859-1"><LINK
+href="show_bug.cgi?id=4862" rel=First><LINK href="show_bug.cgi?id=40059"
+rel=Prev><LINK href="show_bug.cgi?id=40723" rel=Next><LINK
+href="show_bug.cgi?id=79413" rel=Last><LINK href="buglist.cgi?regetlastlist=1"
+rel=Up><LINK href="buglist.cgi?regetlastlist=1" rel=Contents>
+<META content="MSHTML 6.00.2800.1476" name=GENERATOR></HEAD>
+<BODY text=#000000 vLink=#551a8b aLink=#ff0000 link=#0000ee bgColor=#ffffff
+onload=""><!-- 1.0@bugzilla.org -->
+<TABLE cellSpacing=0 cellPadding=0 width="100%" border=0>
+ <TBODY>
+ <TR>
+ <TD width="100%">
+ <TABLE cellSpacing=0 cellPadding=0 width="100%" bgColor=#006699
+ border=0><TBODY>
+ <TR>
+ <TD width=116 bgColor=#000000><IMG height=50
+ src="40152_files/EclipseBannerPic.jpg" width=115></TD>
+ <TD width=637><A href="http://www.eclipse.org/"><IMG height=50
+ src="40152_files/gradient.jpg" width=282 border=0></A></TD>
+ <TD width=250><IMG height=48 src="40152_files/eproject-simple.gif"
+ width=250></TD></TR></TBODY></TABLE></TD></TR></TBODY></TABLE>
+<TABLE cellSpacing=0 border=0>
+ <TBODY>
+ <TR>
+ <TD vAlign=top align=left>
+ <TABLE cellSpacing=2 cellPadding=0 border=0>
+ <TBODY>
+ <TR>
+ <TD vAlign=top noWrap align=left><FONT size=+1><B>Bugzilla Bug
+ 40152</B></FONT> </TD></TR></TBODY></TABLE></TD>
+ <TD vAlign=center>&nbsp;</TD>
+ <TD vAlign=center align=left>Junit tests fail on GTK</TD></TR></TBODY></TABLE><!-- 1.0@bugzilla.org --><B>Bug List:</B> (18 of
+183) <A href="https://bugs.eclipse.org/bugs/show_bug.cgi?id=4862">First</A> <A
+href="https://bugs.eclipse.org/bugs/show_bug.cgi?id=79413">Last</A> <A
+href="https://bugs.eclipse.org/bugs/show_bug.cgi?id=40059">Prev</A> <A
+href="https://bugs.eclipse.org/bugs/show_bug.cgi?id=40723">Next</A>
+&nbsp;&nbsp;<A
+href="https://bugs.eclipse.org/bugs/buglist.cgi?regetlastlist=1">Show list</A>
+&nbsp;&nbsp;&nbsp;&nbsp;&nbsp;<A
+href="https://bugs.eclipse.org/bugs/query.cgi">Query page</A>
+&nbsp;&nbsp;&nbsp;&nbsp;&nbsp;<A
+href="https://bugs.eclipse.org/bugs/enter_bug.cgi">Enter new bug</A>
+<HR>
+
+<FORM name=changeform action=process_bug.cgi method=post><INPUT type=hidden
+value=20040525174037 name=delta_ts> <INPUT type=hidden value=2
+name=longdesclength> <INPUT type=hidden value=40152 name=id>
+<TABLE cellSpacing=1 cellPadding=1 border=0>
+ <TBODY>
+ <TR>
+ <TD align=right><B>Bug#:</B> </TD>
+ <TD><A
+ href="https://bugs.eclipse.org/bugs/show_bug.cgi?id=40152">40152</A> </TD>
+ <TD>&nbsp;</TD>
+ <TD align=right><B>Platform:</B> </TD>
+ <TD><SELECT name=rep_platform> <OPTION value=All>All</OPTION> <OPTION
+ value=Macintosh>Macintosh</OPTION> <OPTION value=PC selected>PC</OPTION>
+ <OPTION value="Power PC">Power PC</OPTION> <OPTION
+ value=Sun>Sun</OPTION> <OPTION value=Other>Other</OPTION></SELECT> </TD>
+ <TD>&nbsp;</TD>
+ <TD align=right><B>Reporter:</B> </TD>
+ <TD>christophe_cornu@ca.ibm.com (Christophe Cornu) </TD></TR>
+ <TR>
+ <TD align=right><B>Product:</B> </TD>
+ <TD><SELECT name=product> <OPTION value=AJDT>AJDT</OPTION> <OPTION
+ value=AspectJ>AspectJ</OPTION> <OPTION value=Birt>Birt</OPTION> <OPTION
+ value=CDT>CDT</OPTION> <OPTION value=CME>CME</OPTION> <OPTION
+ value=Community>Community</OPTION> <OPTION value=ECESIS>ECESIS</OPTION>
+ <OPTION value=ECF>ECF</OPTION> <OPTION value=EMF>EMF</OPTION> <OPTION
+ value=Equinox>Equinox</OPTION> <OPTION value=ERCP>ERCP</OPTION> <OPTION
+ value=GEF>GEF</OPTION> <OPTION value=GMT>GMT</OPTION> <OPTION
+ value=Hyades>Hyades</OPTION> <OPTION value=JDT>JDT</OPTION> <OPTION
+ value=OMELET>OMELET</OPTION> <OPTION value=PDE>PDE</OPTION> <OPTION
+ value=Platform selected>Platform</OPTION> <OPTION
+ value=Pollinate>Pollinate</OPTION> <OPTION
+ value=Stellation>Stellation</OPTION> <OPTION value=UML2>UML2</OPTION>
+ <OPTION value=VE>VE</OPTION> <OPTION value="Web Tools">Web
+ Tools</OPTION> <OPTION value=WSVT>WSVT</OPTION> <OPTION
+ value=XSD>XSD</OPTION></SELECT> </TD>
+ <TD>&nbsp;</TD>
+ <TD align=right><B>OS:</B> </TD>
+ <TD><SELECT name=op_sys> <OPTION value=All>All</OPTION> <OPTION
+ value="AIX Motif">AIX Motif</OPTION> <OPTION value="Windows 95">Windows
+ 95</OPTION> <OPTION value="Windows 98">Windows 98</OPTION> <OPTION
+ value="Windows CE">Windows CE</OPTION> <OPTION
+ value="Windows ME">Windows ME</OPTION> <OPTION
+ value="Windows 2000">Windows 2000</OPTION> <OPTION
+ value="Windows NT">Windows NT</OPTION> <OPTION
+ value="Windows XP">Windows XP</OPTION> <OPTION
+ value="Windows All">Windows All</OPTION> <OPTION value="MacOS X">MacOS
+ X</OPTION> <OPTION value=Linux>Linux</OPTION> <OPTION value=Linux-GTK
+ selected>Linux-GTK</OPTION> <OPTION
+ value=Linux-Motif>Linux-Motif</OPTION> <OPTION
+ value=HP-UX>HP-UX</OPTION> <OPTION value=Neutrino>Neutrino</OPTION>
+ <OPTION value=QNX-Photon>QNX-Photon</OPTION> <OPTION
+ value=Solaris>Solaris</OPTION> <OPTION
+ value=Solaris-GTK>Solaris-GTK</OPTION> <OPTION
+ value=Solaris-Motif>Solaris-Motif</OPTION> <OPTION value="Unix All">Unix
+ All</OPTION> <OPTION value=other>other</OPTION></SELECT> </TD>
+ <TD>&nbsp;</TD>
+ <TD align=right><B>Add&nbsp;CC:</B> </TD>
+ <TD><INPUT size=30 name=newcc> </TD></TR>
+ <TR>
+ <TD align=right><B><A
+ href="https://bugs.eclipse.org/bugs/describecomponents.cgi?product=Platform">Component</A>:
+ </B></TD>
+ <TD><SELECT name=component> <OPTION value=Ant>Ant</OPTION> <OPTION
+ value=Compare>Compare</OPTION> <OPTION value=CVS>CVS</OPTION> <OPTION
+ value=Debug>Debug</OPTION> <OPTION value=Doc>Doc</OPTION> <OPTION
+ value=Help>Help</OPTION> <OPTION value=Intro>Intro</OPTION> <OPTION
+ value=Releng>Releng</OPTION> <OPTION value=Resources>Resources</OPTION>
+ <OPTION value=Runtime>Runtime</OPTION> <OPTION
+ value=Scripting>Scripting</OPTION> <OPTION value=Search>Search</OPTION>
+ <OPTION value=SWT selected>SWT</OPTION> <OPTION value=Team>Team</OPTION>
+ <OPTION value=Text>Text</OPTION> <OPTION value=UI>UI</OPTION> <OPTION
+ value=Update>Update</OPTION> <OPTION value=WebDAV>WebDAV</OPTION></SELECT>
+ </TD>
+ <TD>&nbsp;</TD>
+ <TD align=right><B>Version:</B> </TD>
+ <TD><SELECT name=version> <OPTION value=1.0>1.0</OPTION> <OPTION
+ value=2.0>2.0</OPTION> <OPTION value=2.0.1>2.0.1</OPTION> <OPTION
+ value=2.0.2>2.0.2</OPTION> <OPTION value=2.1>2.1</OPTION> <OPTION
+ value=2.1.1>2.1.1</OPTION> <OPTION value=2.1.2>2.1.2</OPTION> <OPTION
+ value=2.1.3>2.1.3</OPTION> <OPTION value=3.0 selected>3.0</OPTION>
+ <OPTION value=3.0.1>3.0.1</OPTION> <OPTION value=3.1>3.1</OPTION></SELECT>
+ </TD>
+ <TD>&nbsp;</TD>
+ <TD vAlign=top align=right rowSpan=4><B>CC:</B> </TD>
+ <TD vAlign=top rowSpan=4><INPUT type=hidden name=cc> </TD></TR>
+ <TR>
+ <TD align=right><B><A
+ href="https://bugs.eclipse.org/bugs/bug_status.html">Status</A>: </B></TD>
+ <TD>NEW</TD>
+ <TD>&nbsp;</TD>
+ <TD align=right><B><A
+ href="https://bugs.eclipse.org/bugs/bug_status.html#priority">Priority</A>:</B>
+ </TD>
+ <TD><SELECT name=priority> <OPTION value=P1>P1</OPTION> <OPTION
+ value=P2>P2</OPTION> <OPTION value=P3 selected>P3</OPTION> <OPTION
+ value=P4>P4</OPTION> <OPTION value=P5>P5</OPTION></SELECT> </TD>
+ <TD>&nbsp;</TD></TR>
+ <TR>
+ <TD align=right><B><A
+ href="https://bugs.eclipse.org/bugs/bug_status.html">Resolution</A>:
+ </B></TD>
+ <TD></TD>
+ <TD>&nbsp;</TD>
+ <TD align=right><B><A
+ href="https://bugs.eclipse.org/bugs/bug_status.html#severity">Severity</A>:</B>
+ </TD>
+ <TD><SELECT name=bug_severity> <OPTION value=blocker>blocker</OPTION>
+ <OPTION value=critical>critical</OPTION> <OPTION value=major
+ selected>major</OPTION> <OPTION value=normal>normal</OPTION> <OPTION
+ value=minor>minor</OPTION> <OPTION value=trivial>trivial</OPTION>
+ <OPTION value=enhancement>enhancement</OPTION></SELECT> </TD>
+ <TD>&nbsp;</TD></TR>
+ <TR>
+ <TD align=right><B><A
+ href="https://bugs.eclipse.org/bugs/bug_status.html#assigned_to">Assigned&nbsp;To</A>:
+ </B></TD>
+ <TD>felipe_heidrich@ca.ibm.com (Felipe Heidrich)</TD>
+ <TD>&nbsp;</TD>
+ <TD align=right><B><A
+ href="https://bugs.eclipse.org/bugs/notargetmilestone.html">Target
+ Milestone</A>: </B></TD>
+ <TD><SELECT name=target_milestone> <OPTION value="2.0 M1">2.0
+ M1</OPTION> <OPTION value="2.0 M2">2.0 M2</OPTION> <OPTION
+ value="2.0 M3">2.0 M3</OPTION> <OPTION value="2.0 M4">2.0 M4</OPTION>
+ <OPTION value="2.0 M5">2.0 M5</OPTION> <OPTION value="2.0 M6">2.0
+ M6</OPTION> <OPTION value="2.0 F1">2.0 F1</OPTION> <OPTION
+ value="2.0 F2">2.0 F2</OPTION> <OPTION value="2.0 F3">2.0 F3</OPTION>
+ <OPTION value="2.0 F4">2.0 F4</OPTION> <OPTION
+ value=2.0.1>2.0.1</OPTION> <OPTION value=2.0.2>2.0.2</OPTION> <OPTION
+ value=2.1>2.1</OPTION> <OPTION value="2.1 M1">2.1 M1</OPTION> <OPTION
+ value="2.1 M2">2.1 M2</OPTION> <OPTION value="2.1 M3">2.1 M3</OPTION>
+ <OPTION value="2.1 M4">2.1 M4</OPTION> <OPTION value="2.1 M5">2.1
+ M5</OPTION> <OPTION value="2.1 RC1">2.1 RC1</OPTION> <OPTION
+ value="2.1 RC2">2.1 RC2</OPTION> <OPTION value="2.1 RC3">2.1
+ RC3</OPTION> <OPTION value="2.1 RC4">2.1 RC4</OPTION> <OPTION
+ value=2.1.1>2.1.1</OPTION> <OPTION value=2.1.2>2.1.2</OPTION> <OPTION
+ value=2.1.3>2.1.3</OPTION> <OPTION value=3.0>3.0</OPTION> <OPTION
+ value="3.0 M1">3.0 M1</OPTION> <OPTION value="3.0 M2">3.0 M2</OPTION>
+ <OPTION value="3.0 M3">3.0 M3</OPTION> <OPTION value="3.0 M4">3.0
+ M4</OPTION> <OPTION value="3.0 M5">3.0 M5</OPTION> <OPTION
+ value="3.0 M6">3.0 M6</OPTION> <OPTION value="3.0 M7">3.0 M7</OPTION>
+ <OPTION value="3.0 M8">3.0 M8</OPTION> <OPTION value="3.0 M9">3.0
+ M9</OPTION> <OPTION value="3.0 RC1">3.0 RC1</OPTION> <OPTION
+ value="3.0 RC2">3.0 RC2</OPTION> <OPTION value="3.0 RC3">3.0
+ RC3</OPTION> <OPTION value="3.0 RC4">3.0 RC4</OPTION> <OPTION
+ value=3.0.1>3.0.1</OPTION> <OPTION value=3.0.2>3.0.2</OPTION> <OPTION
+ value=3.1>3.1</OPTION> <OPTION value="3.1 M1">3.1 M1</OPTION> <OPTION
+ value="3.1 M2">3.1 M2</OPTION> <OPTION value="3.1 M3">3.1 M3</OPTION>
+ <OPTION value="3.1 M4">3.1 M4</OPTION> <OPTION value="3.1 M5">3.1
+ M5</OPTION> <OPTION value="3.1 M6">3.1 M6</OPTION> <OPTION value=---
+ selected>---</OPTION></SELECT> </TD>
+ <TD>&nbsp;</TD></TR>
+ <TR>
+ <TD align=right><B>URL: </B></TD>
+ <TD colSpan=7><INPUT size=60 name=bug_file_loc> </TD></TR>
+ <TR>
+ <TD align=right><B>Summary:</B> </TD>
+ <TD colSpan=7><INPUT size=60 value="Junit tests fail on GTK"
+ name=short_desc> </TD></TR>
+ <TR>
+ <TD align=right><B><A
+ href="https://bugs.eclipse.org/bugs/describekeywords.cgi">Keywords</A>:
+ </B>
+ <TD colSpan=7><INPUT size=60 name=keywords> </TD></TR></TBODY></TABLE><!-- 1.0@bugzilla.org --><BR>
+<TABLE cellSpacing=0 cellPadding=4 border=1>
+ <TBODY>
+ <TR>
+ <TH align=left bgColor=#cccccc>Attachment</TH>
+ <TH align=left bgColor=#cccccc>Type</TH>
+ <TH align=left bgColor=#cccccc>Modified</TH>
+ <TH align=left bgColor=#cccccc>Status</TH>
+ <TH align=left bgColor=#cccccc>Actions</TH></TR>
+ <TR>
+ <TD colSpan=4><A
+ href="https://bugs.eclipse.org/bugs/attachment.cgi?bugid=40152&amp;action=enter">Create
+ a New Attachment</A> (proposed patch, testcase, etc.) </TD>
+ <TD><A
+ href="https://bugs.eclipse.org/bugs/attachment.cgi?bugid=40152&amp;action=viewall">View
+ All</A> </TD></TR></TBODY></TABLE><BR>
+<TABLE>
+ <TBODY>
+ <TR>
+ <TH align=right>Bug 40152 depends on:</TH>
+ <TD></TD>
+ <TD><INPUT name=dependson> </TD>
+ <TD rowSpan=2><A
+ href="https://bugs.eclipse.org/bugs/showdependencytree.cgi?id=40152">Show
+ dependency tree</A> </TD></TR>
+ <TR>
+ <TH align=right>Bug 40152 blocks:</TH>
+ <TD></TD>
+ <TD><INPUT name=blocked> </TD></TR></TBODY></TABLE>
+<TABLE>
+ <TBODY>
+ <TR>
+ <TH><A href="https://bugs.eclipse.org/bugs/votehelp.html">Votes</A>: </TH>
+ <TD>0&nbsp;&nbsp;&nbsp; <A
+ href="https://bugs.eclipse.org/bugs/votes.cgi?action=show_bug&amp;bug_id=40152">Show
+ votes for this bug</A>&nbsp;&nbsp;&nbsp; <A
+ href="https://bugs.eclipse.org/bugs/votes.cgi?action=show_user&amp;bug_id=40152">Vote
+ for this bug</A> </TD></TR></TBODY></TABLE><BR><B>Additional Comments:</B> <BR><TEXTAREA accessKey=c name=comment rows=10 wrap=hard cols=80></TEXTAREA>
+<BR><BR><INPUT type=radio CHECKED value=none name=knob> Leave as
+<B>NEW&nbsp;</B> <BR><INPUT type=radio value=accept name=knob> Accept bug
+(change status to <B>ASSIGNED</B>) <BR><INPUT type=radio value=resolve
+name=knob> Resolve bug, changing <A
+href="https://bugs.eclipse.org/bugs/bug_status.html">resolution</A> to <SELECT
+onchange=document.changeform.knob[2].checked=true name=resolution> <OPTION
+ value=FIXED selected>FIXED</OPTION> <OPTION value=INVALID>INVALID</OPTION>
+ <OPTION value=WONTFIX>WONTFIX</OPTION> <OPTION value=LATER>LATER</OPTION>
+ <OPTION value=REMIND>REMIND</OPTION> <OPTION
+ value=WORKSFORME>WORKSFORME</OPTION></SELECT> <BR><INPUT type=radio
+value=duplicate name=knob> Resolve bug, mark it as duplicate of bug # <INPUT
+onchange="if (this.value != '')&#10; {document.changeform.knob[3].checked=true}"
+size=6 name=dup_id> <BR><INPUT type=radio value=reassign name=knob> <A
+href="https://bugs.eclipse.org/bugs/bug_status.html#assigned_to">Reassign</A>
+bug to <INPUT
+onchange="if ((this.value != 'felipe_heidrich@ca.ibm.com') &amp;&amp; &#10; (this.value != '')) {&#10; document.changeform.knob[4].checked=true; &#10; }"
+size=32 value=felipe_heidrich@ca.ibm.com name=assigned_to> <BR><INPUT type=radio
+value=reassignbycomponent name=knob> Reassign bug to owner of selected component
+<BR><INPUT type=submit value=Commit> <INPUT type=hidden value=process_bug
+name=form_name>
+<P><FONT size=+1><B><A
+href="https://bugs.eclipse.org/bugs/show_activity.cgi?id=40152">View Bug
+Activity</A> &nbsp; | &nbsp; <A
+href="https://bugs.eclipse.org/bugs/long_list.cgi?buglist=40152">Format For
+Printing</A> </B></FONT></P></FORM>
+<TABLE>
+ <TBODY>
+ <TR>
+ <TD align=left><B><A
+ href="https://bugs.eclipse.org/bugs/show_bug.cgi?id=40152#c0"
+ name=c0>Description</A>: </B></TD>
+ <TD align=right width="100%">Opened: 2003-07-15 16:25 </TD></TR></TBODY></TABLE>
+<HR>
+<!-- 1.0@bugzilla.org --><PRE>latest from head (20030715) generate about 30 errors/failures.
+
+.........................................
+.........................................
+.........................E................
+..........4
+5
+...............................
+.........................................
+.........................................
+.........................................
+.........................................
+.........................................
+...........F.....F...........F.E.E............
+.................F....F....................
+..........
+(&lt;unknown&gt;:6548): Gdk-CRITICAL **: file gdkdraw.c: line 238
+(gdk_drawable_get_display): assertion `GDK_IS_DRAWABLE (drawable)' failed
+
+(&lt;unknown&gt;:6548): Gdk-CRITICAL **: file gdkdisplay.c: line 498
+(gdk_display_get_window_at_pointer): assertion `GDK_IS_DISPLAY (display)'
+failed
+........
+(&lt;unknown&gt;:6548): Gdk-CRITICAL **: file gdkdraw.c: line 238
+(gdk_drawable_get_display): assertion `GDK_IS_DRAWABLE (drawable)' failed
+
+(&lt;unknown&gt;:6548): Gdk-CRITICAL **: file gdkdisplay.c: line 498
+(gdk_display_get_window_at_pointer): assertion `GDK_IS_DISPLAY (display)'
+failed
+.......................
+.........................................
+..............F...........................
+.........................................
+....................................F.....
+.........................................
+.........................................
+.........................................
+.......................................
+(&lt;unknown&gt;:6548): Gtk-CRITICAL **: file gtkwidget.c: line 5139
+(gtk_widget_set_size_request): assertion `width &gt;= -1' failed
+
+(&lt;unknown&gt;:6548): Gtk-CRITICAL **: file gtkwidget.c: line 5139
+(gtk_widget_set_size_request): assertion `width &gt;= -1' failed
+..
+...................
+(&lt;unknown&gt;:6548): Gtk-CRITICAL **: file gtkwidget.c: line 5139
+(gtk_widget_set_size_request): assertion `width &gt;= -1' failed
+
+(&lt;unknown&gt;:6548): Gtk-CRITICAL **: file gtkwidget.c: line 5139
+(gtk_widget_set_size_request): assertion `width &gt;= -1' failed
+......................
+.........................................
+..................................
+(&lt;unknown&gt;:6548): Gtk-CRITICAL **: file gtktreeview.c: line 9817
+(gtk_tree_view_get_path_at_pos): assertion `tree_view-&gt;priv-&gt;bin_window !=
+NULL' failed
+
+(&lt;unknown&gt;:6548): Gtk-CRITICAL **: file gtktreeview.c: line 9817
+(gtk_tree_view_get_path_at_pos): assertion `tree_view-&gt;priv-&gt;bin_window !=
+NULL' failed
+.......
+...
+(&lt;unknown&gt;:6548): Gtk-CRITICAL **: file gtkliststore.c: line 533
+(gtk_list_store_get_path): assertion `iter-&gt;stamp == GTK_LIST_STORE
+(tree_model)-&gt;stamp' failed
+
+(&lt;unknown&gt;:6548): Gtk-CRITICAL **: file gtkliststore.c: line 533
+(gtk_list_store_get_path): assertion `iter-&gt;stamp == GTK_LIST_STORE
+(tree_model)-&gt;stamp' failed
+.........
+(&lt;unknown&gt;:6548): Gtk-CRITICAL **: file gtkliststore.c: line 533
+(gtk_list_store_get_path): assertion `iter-&gt;stamp == GTK_LIST_STORE
+(tree_model)-&gt;stamp' failed
+..
+(&lt;unknown&gt;:6548): Gtk-CRITICAL **: file gtktreeview.c: line 9817
+(gtk_tree_view_get_path_at_pos): assertion `tree_view-&gt;priv-&gt;bin_window !=
+NULL' failed
+
+(&lt;unknown&gt;:6548): Gtk-CRITICAL **: file gtktreeview.c: line 9817
+(gtk_tree_view_get_path_at_pos): assertion `tree_view-&gt;priv-&gt;bin_window !=
+NULL' failed
+
+(&lt;unknown&gt;:6548): Gtk-CRITICAL **: file gtktreeview.c: line 9817
+(gtk_tree_view_get_path_at_pos): assertion `tree_view-&gt;priv-&gt;bin_window !=
+NULL' failed
+F...........................
+.........................................
+........................................F.
+............F........F........F...F..........
+.........................................
+.........................................
+.....................F.F...................
+.........................................
+.........................................
+................................
+(&lt;unknown&gt;:6548): Gtk-CRITICAL **: file gtktreeview.c: line 9817
+(gtk_tree_view_get_path_at_pos): assertion `tree_view-&gt;priv-&gt;bin_window !=
+NULL' failed
+F.
+(&lt;unknown&gt;:6548): Gtk-CRITICAL **: file gtktreestore.c: line 569
+(gtk_tree_store_get_path): assertion `iter-&gt;stamp == GTK_TREE_STORE
+(tree_model)-&gt;stamp' failed
+
+(&lt;unknown&gt;:6548): Gtk-CRITICAL **: file gtktreemodel.c: line 369
+(gtk_tree_path_get_depth): assertion `path != NULL' failed
+
+(&lt;unknown&gt;:6548): Gtk-CRITICAL **: file gtktreeview.c: line 8800
+(gtk_tree_view_scroll_to_cell): assertion `path != NULL || column != NULL'
+failed
+
+(&lt;unknown&gt;:6548): Gtk-CRITICAL **: file gtktreemodel.c: line 400
+(gtk_tree_path_free): assertion `path != NULL' failed
+
+(&lt;unknown&gt;:6548): Gtk-CRITICAL **: file gtktreestore.c: line 569
+(gtk_tree_store_get_path): assertion `iter-&gt;stamp == GTK_TREE_STORE
+(tree_model)-&gt;stamp' failed
+
+(&lt;unknown&gt;:6548): Gtk-CRITICAL **: file gtktreemodel.c: line 369
+(gtk_tree_path_get_depth): assertion `path != NULL' failed
+
+(&lt;unknown&gt;:6548): Gtk-CRITICAL **: file gtktreeview.c: line 8800
+(gtk_tree_view_scroll_to_cell): assertion `path != NULL || column != NULL'
+failed
+
+(&lt;unknown&gt;:6548): Gtk-CRITICAL **: file gtktreemodel.c: line 400
+(gtk_tree_path_free): assertion `path != NULL' failed
+
+(&lt;unknown&gt;:6548): Gtk-CRITICAL **: file gtktreestore.c: line 569
+(gtk_tree_store_get_path): assertion `iter-&gt;stamp == GTK_TREE_STORE
+(tree_model)-&gt;stamp' failed
+
+(&lt;unknown&gt;:6548): Gtk-CRITICAL **: file gtktreemodel.c: line 369
+(gtk_tree_path_get_depth): assertion `path != NULL' failed
+
+(&lt;unknown&gt;:6548): Gtk-CRITICAL **: file gtktreeview.c: line 8800
+(gtk_tree_view_scroll_to_cell): assertion `path != NULL || column != NULL'
+failed
+
+(&lt;unknown&gt;:6548): Gtk-CRITICAL **: file gtktreemodel.c: line 400
+(gtk_tree_path_free): assertion `path != NULL' failed
+
+(&lt;unknown&gt;:6548): Gtk-CRITICAL **: file gtktreestore.c: line 569
+(gtk_tree_store_get_path): assertion `iter-&gt;stamp == GTK_TREE_STORE
+(tree_model)-&gt;stamp' failed
+
+(&lt;unknown&gt;:6548): Gtk-CRITICAL **: file gtktreemodel.c: line 369
+(gtk_tree_path_get_depth): assertion `path != NULL' failed
+
+(&lt;unknown&gt;:6548): Gtk-CRITICAL **: file gtktreeview.c: line 8800
+(gtk_tree_view_scroll_to_cell): assertion `path != NULL || column != NULL'
+failed
+
+(&lt;unknown&gt;:6548): Gtk-CRITICAL **: file gtktreemodel.c: line 400
+(gtk_tree_path_free): assertion `path != NULL' failed
+
+(&lt;unknown&gt;:6548): Gtk-CRITICAL **: file gtktreestore.c: line 569
+(gtk_tree_store_get_path): assertion `iter-&gt;stamp == GTK_TREE_STORE
+(tree_model)-&gt;stamp' failed
+
+(&lt;unknown&gt;:6548): Gtk-CRITICAL **: file gtktreemodel.c: line 369
+(gtk_tree_path_get_depth): assertion `path != NULL' failed
+
+(&lt;unknown&gt;:6548): Gtk-CRITICAL **: file gtktreeview.c: line 8800
+(gtk_tree_view_scroll_to_cell): assertion `path != NULL || column != NULL'
+failed
+
+(&lt;unknown&gt;:6548): Gtk-CRITICAL **: file gtktreemodel.c: line 400
+(gtk_tree_path_free): assertion `path != NULL' failed
+
+(&lt;unknown&gt;:6548): Gtk-CRITICAL **: file gtktreestore.c: line 569
+(gtk_tree_store_get_path): assertion `iter-&gt;stamp == GTK_TREE_STORE
+(tree_model)-&gt;stamp' failed
+
+(&lt;unknown&gt;:6548): Gtk-CRITICAL **: file gtktreemodel.c: line 369
+(gtk_tree_path_get_depth): assertion `path != NULL' failed
+
+(&lt;unknown&gt;:6548): Gtk-CRITICAL **: file gtktreeview.c: line 8800
+(gtk_tree_view_scroll_to_cell): assertion `path != NULL || column != NULL'
+failed
+
+(&lt;unknown&gt;:6548): Gtk-CRITICAL **: file gtktreemodel.c: line 400
+(gtk_tree_path_free): assertion `path != NULL' failed
+
+(&lt;unknown&gt;:6548): Gtk-CRITICAL **: file gtktreestore.c: line 569
+(gtk_tree_store_get_path): assertion `iter-&gt;stamp == GTK_TREE_STORE
+(tree_model)-&gt;stamp' failed
+
+(&lt;unknown&gt;:6548): Gtk-CRITICAL **: file gtktreemodel.c: line 369
+(gtk_tree_path_get_depth): assertion `path != NULL' failed
+
+(&lt;unknown&gt;:6548): Gtk-CRITICAL **: file gtktreeview.c: line 8800
+(gtk_tree_view_scroll_to_cell): assertion `path != NULL || column != NULL'
+failed
+
+(&lt;unknown&gt;:6548): Gtk-CRITICAL **: file gtktreemodel.c: line 400
+(gtk_tree_path_free): assertion `path != NULL' failed
+
+(&lt;unknown&gt;:6548): Gtk-CRITICAL **: file gtktreestore.c: line 569
+(gtk_tree_store_get_path): assertion `iter-&gt;stamp == GTK_TREE_STORE
+(tree_model)-&gt;stamp' failed
+
+(&lt;unknown&gt;:6548): Gtk-CRITICAL **: file gtktreemodel.c: line 369
+(gtk_tree_path_get_depth): assertion `path != NULL' failed
+
+(&lt;unknown&gt;:6548): Gtk-CRITICAL **: file gtktreeview.c: line 8800
+(gtk_tree_view_scroll_to_cell): assertion `path != NULL || column != NULL'
+failed
+
+(&lt;unknown&gt;:6548): Gtk-CRITICAL **: file gtktreemodel.c: line 400
+(gtk_tree_path_free): assertion `path != NULL' failed
+
+(&lt;unknown&gt;:6548): Gtk-CRITICAL **: file gtktreestore.c: line 569
+(gtk_tree_store_get_path): assertion `iter-&gt;stamp == GTK_TREE_STORE
+(tree_model)-&gt;stamp' failed
+
+(&lt;unknown&gt;:6548): Gtk-CRITICAL **: file gtktreemodel.c: line 369
+(gtk_tree_path_get_depth): assertion `path != NULL' failed
+
+(&lt;unknown&gt;:6548): Gtk-CRITICAL **: file gtktreeview.c: line 8800
+(gtk_tree_view_scroll_to_cell): assertion `path != NULL || column != NULL'
+failed
+
+(&lt;unknown&gt;:6548): Gtk-CRITICAL **: file gtktreemodel.c: line 400
+(gtk_tree_path_free): assertion `path != NULL' failed
+
+(&lt;unknown&gt;:6548): Gtk-CRITICAL **: file gtktreestore.c: line 569
+(gtk_tree_store_get_path): assertion `iter-&gt;stamp == GTK_TREE_STORE
+(tree_model)-&gt;stamp' failed
+
+(&lt;unknown&gt;:6548): Gtk-CRITICAL **: file gtktreemodel.c: line 369
+(gtk_tree_path_get_depth): assertion `path != NULL' failed
+
+(&lt;unknown&gt;:6548): Gtk-CRITICAL **: file gtktreeview.c: line 8800
+(gtk_tree_view_scroll_to_cell): assertion `path != NULL || column != NULL'
+failed
+
+(&lt;unknown&gt;:6548): Gtk-CRITICAL **: file gtktreemodel.c: line 400
+(gtk_tree_path_free): assertion `path != NULL' failed
+
+(&lt;unknown&gt;:6548): Gtk-CRITICAL **: file gtktreestore.c: line 569
+(gtk_tree_store_get_path): assertion `iter-&gt;stamp == GTK_TREE_STORE
+(tree_model)-&gt;stamp' failed
+
+(&lt;unknown&gt;:6548): Gtk-CRITICAL **: file gtktreemodel.c: line 369
+(gtk_tree_path_get_depth): assertion `path != NULL' failed
+
+(&lt;unknown&gt;:6548): Gtk-CRITICAL **: file gtktreeview.c: line 8800
+(gtk_tree_view_scroll_to_cell): assertion `path != NULL || column != NULL'
+failed
+
+(&lt;unknown&gt;:6548): Gtk-CRITICAL **: file gtktreemodel.c: line 400
+(gtk_tree_path_free): assertion `path != NULL' failed
+
+(&lt;unknown&gt;:6548): Gtk-CRITICAL **: file gtktreestore.c: line 569
+(gtk_tree_store_get_path): assertion `iter-&gt;stamp == GTK_TREE_STORE
+(tree_model)-&gt;stamp' failed
+
+(&lt;unknown&gt;:6548): Gtk-CRITICAL **: file gtktreemodel.c: line 369
+(gtk_tree_path_get_depth): assertion `path != NULL' failed
+
+(&lt;unknown&gt;:6548): Gtk-CRITICAL **: file gtktreeview.c: line 8800
+(gtk_tree_view_scroll_to_cell): assertion `path != NULL || column != NULL'
+failed
+
+(&lt;unknown&gt;:6548): Gtk-CRITICAL **: file gtktreemodel.c: line 400
+(gtk_tree_path_free): assertion `path != NULL' failed
+
+(&lt;unknown&gt;:6548): Gtk-CRITICAL **: file gtktreestore.c: line 569
+(gtk_tree_store_get_path): assertion `iter-&gt;stamp == GTK_TREE_STORE
+(tree_model)-&gt;stamp' failed
+
+(&lt;unknown&gt;:6548): Gtk-CRITICAL **: file gtktreemodel.c: line 369
+(gtk_tree_path_get_depth): assertion `path != NULL' failed
+
+(&lt;unknown&gt;:6548): Gtk-CRITICAL **: file gtktreeview.c: line 8800
+(gtk_tree_view_scroll_to_cell): assertion `path != NULL || column != NULL'
+failed
+
+(&lt;unknown&gt;:6548): Gtk-CRITICAL **: file gtktreemodel.c: line 400
+(gtk_tree_path_free): assertion `path != NULL' failed
+
+(&lt;unknown&gt;:6548): Gtk-CRITICAL **: file gtktreestore.c: line 569
+(gtk_tree_store_get_path): assertion `iter-&gt;stamp == GTK_TREE_STORE
+(tree_model)-&gt;stamp' failed
+
+(&lt;unknown&gt;:6548): Gtk-CRITICAL **: file gtktreemodel.c: line 369
+(gtk_tree_path_get_depth): assertion `path != NULL' failed
+
+(&lt;unknown&gt;:6548): Gtk-CRITICAL **: file gtktreeview.c: line 8800
+(gtk_tree_view_scroll_to_cell): assertion `path != NULL || column != NULL'
+failed
+
+(&lt;unknown&gt;:6548): Gtk-CRITICAL **: file gtktreemodel.c: line 400
+(gtk_tree_path_free): assertion `path != NULL' failed
+
+(&lt;unknown&gt;:6548): Gtk-CRITICAL **: file gtktreestore.c: line 569
+(gtk_tree_store_get_path): assertion `iter-&gt;stamp == GTK_TREE_STORE
+(tree_model)-&gt;stamp' failed
+
+(&lt;unknown&gt;:6548): Gtk-CRITICAL **: file gtktreemodel.c: line 369
+(gtk_tree_path_get_depth): assertion `path != NULL' failed
+
+(&lt;unknown&gt;:6548): Gtk-CRITICAL **: file gtktreeview.c: line 8800
+(gtk_tree_view_scroll_to_cell): assertion `path != NULL || column != NULL'
+failed
+
+(&lt;unknown&gt;:6548): Gtk-CRITICAL **: file gtktreemodel.c: line 400
+(gtk_tree_path_free): assertion `path != NULL' failed
+
+(&lt;unknown&gt;:6548): Gtk-CRITICAL **: file gtktreestore.c: line 569
+(gtk_tree_store_get_path): assertion `iter-&gt;stamp == GTK_TREE_STORE
+(tree_model)-&gt;stamp' failed
+
+(&lt;unknown&gt;:6548): Gtk-CRITICAL **: file gtktreemodel.c: line 369
+(gtk_tree_path_get_depth): assertion `path != NULL' failed
+
+(&lt;unknown&gt;:6548): Gtk-CRITICAL **: file gtktreeview.c: line 8800
+(gtk_tree_view_scroll_to_cell): assertion `path != NULL || column != NULL'
+failed
+
+(&lt;unknown&gt;:6548): Gtk-CRITICAL **: file gtktreemodel.c: line 400
+(gtk_tree_path_free): assertion `path != NULL' failed
+
+(&lt;unknown&gt;:6548): Gtk-CRITICAL **: file gtktreestore.c: line 569
+(gtk_tree_store_get_path): assertion `iter-&gt;stamp == GTK_TREE_STORE
+(tree_model)-&gt;stamp' failed
+
+(&lt;unknown&gt;:6548): Gtk-CRITICAL **: file gtktreemodel.c: line 369
+(gtk_tree_path_get_depth): assertion `path != NULL' failed
+
+(&lt;unknown&gt;:6548): Gtk-CRITICAL **: file gtktreeview.c: line 8800
+(gtk_tree_view_scroll_to_cell): assertion `path != NULL || column != NULL'
+failed
+
+(&lt;unknown&gt;:6548): Gtk-CRITICAL **: file gtktreemodel.c: line 400
+(gtk_tree_path_free): assertion `path != NULL' failed
+
+(&lt;unknown&gt;:6548): Gtk-CRITICAL **: file gtktreestore.c: line 569
+(gtk_tree_store_get_path): assertion `iter-&gt;stamp == GTK_TREE_STORE
+(tree_model)-&gt;stamp' failed
+
+(&lt;unknown&gt;:6548): Gtk-CRITICAL **: file gtktreemodel.c: line 369
+(gtk_tree_path_get_depth): assertion `path != NULL' failed
+
+(&lt;unknown&gt;:6548): Gtk-CRITICAL **: file gtktreeview.c: line 8800
+(gtk_tree_view_scroll_to_cell): assertion `path != NULL || column != NULL'
+failed
+
+(&lt;unknown&gt;:6548): Gtk-CRITICAL **: file gtktreemodel.c: line 400
+(gtk_tree_path_free): assertion `path != NULL' failed
+
+(&lt;unknown&gt;:6548): Gtk-CRITICAL **: file gtktreestore.c: line 569
+(gtk_tree_store_get_path): assertion `iter-&gt;stamp == GTK_TREE_STORE
+(tree_model)-&gt;stamp' failed
+
+(&lt;unknown&gt;:6548): Gtk-CRITICAL **: file gtktreemodel.c: line 369
+(gtk_tree_path_get_depth): assertion `path != NULL' failed
+
+(&lt;unknown&gt;:6548): Gtk-CRITICAL **: file gtktreeview.c: line 8800
+(gtk_tree_view_scroll_to_cell): assertion `path != NULL || column != NULL'
+failed
+
+(&lt;unknown&gt;:6548): Gtk-CRITICAL **: file gtktreemodel.c: line 400
+(gtk_tree_path_free): assertion `path != NULL' failed
+
+(&lt;unknown&gt;:6548): Gtk-CRITICAL **: file gtktreestore.c: line 569
+(gtk_tree_store_get_path): assertion `iter-&gt;stamp == GTK_TREE_STORE
+(tree_model)-&gt;stamp' failed
+
+(&lt;unknown&gt;:6548): Gtk-CRITICAL **: file gtktreemodel.c: line 369
+(gtk_tree_path_get_depth): assertion `path != NULL' failed
+
+(&lt;unknown&gt;:6548): Gtk-CRITICAL **: file gtktreeview.c: line 8800
+(gtk_tree_view_scroll_to_cell): assertion `path != NULL || column != NULL'
+failed
+
+(&lt;unknown&gt;:6548): Gtk-CRITICAL **: file gtktreemodel.c: line 400
+(gtk_tree_path_free): assertion `path != NULL' failed
+........
+.........................................
+.........................................
+...........................F..............
+.........................................
+.........................................
+.............
+(&lt;unknown&gt;:6548): Gtk-CRITICAL **: file gtkeditable.c: line 172
+(gtk_editable_delete_selection): assertion `GTK_IS_EDITABLE (editable)' failed
+
+(&lt;unknown&gt;:6548): Gtk-CRITICAL **: file gtkeditable.c: line 172
+(gtk_editable_delete_selection): assertion `GTK_IS_EDITABLE (editable)' failed
+F....F.......F.......F.E.......E..
+.........................................
+.........................................
+.............................
+(&lt;unknown&gt;:6548): Gtk-CRITICAL **: file gtkframe.c: line 362
+(gtk_frame_set_label_widget): assertion `label_widget == NULL || label_widget-
+&gt;parent == NULL' failed
+............
+.........................................
+.........................................
+................F.........................
+.........................................
+.........................................
+.........................................
+.........................................
+.........................................
+.........................................
+.........................................
+.........................................
+.........................................
+.........................................
+.......................................F.F.
+.........................................
+.........................................
+.........................................
+.........................................
+.........................................
+.........................................
+.........................................
+.........................................
+.........................................
+.........................................
+.........................................
+.........................................
+.........................................
+.........................................
+.........................................
+.........................................
+.........................................
+.........................................
+.........................................
+.........................................
+.........................................
+.........................................
+.........................................
+.........................................
+.........................................
+.........................................
+.........................................
+.........................................
+.........................................
+.........................................
+.........................................
+.........................................
+.........................................
+.........................................
+...........F.F.............................
+..F....F..E.E................................
+....F.F....................................
+.........................................
+.........................................
+.........................................
+.........................................
+.........................................
+.........................................
+.........................................
+.........................................
+.......
+Time: 111.199
+There were 7 errors:
+1) test_getFontData
+(org.eclipse.swt.tests.junit.Test_org_eclipse_swt_graphics_Font)
+java.lang.NullPointerException
+ at org.eclipse.swt.graphics.Font.dispose(Font.java:143)
+ at
+org.eclipse.swt.tests.junit.Test_org_eclipse_swt_graphics_Font.test_getFontData
+(Test_org_eclipse_swt_graphics_Font.java:239)
+ at
+org.eclipse.swt.tests.junit.Test_org_eclipse_swt_graphics_Font.runTest
+(Test_org_eclipse_swt_graphics_Font.java:308)
+ at org.eclipse.swt.tests.junit.AllTests.main(AllTests.java:25)
+2) test_setText$Ljava_lang_String
+(org.eclipse.swt.tests.junit.Test_org_eclipse_swt_widgets_TableItem)
+org.eclipse.swt.SWTError: Cannot get text
+ at org.eclipse.swt.SWT.error(SWT.java:2391)
+ at org.eclipse.swt.SWT.error(SWT.java:2295)
+ at org.eclipse.swt.widgets.Widget.error(Widget.java:375)
+ at org.eclipse.swt.widgets.TableItem.getText(TableItem.java:350)
+ at
+org.eclipse.swt.tests.junit.Test_org_eclipse_swt_widgets_TableItem.test_setText
+$Ljava_lang_String(Test_org_eclipse_swt_widgets_TableItem.java:359)
+ at
+org.eclipse.swt.tests.junit.Test_org_eclipse_swt_widgets_TableItem.runTest
+(Test_org_eclipse_swt_widgets_TableItem.java:518)
+ at org.eclipse.swt.tests.junit.AllTests.main(AllTests.java:25)
+3) test_setTextILjava_lang_String
+(org.eclipse.swt.tests.junit.Test_org_eclipse_swt_widgets_TableItem)
+org.eclipse.swt.SWTError: Cannot get text
+ at org.eclipse.swt.SWT.error(SWT.java:2391)
+ at org.eclipse.swt.SWT.error(SWT.java:2295)
+ at org.eclipse.swt.widgets.Widget.error(Widget.java:375)
+ at org.eclipse.swt.widgets.TableItem.getText(TableItem.java:350)
+ at
+org.eclipse.swt.tests.junit.Test_org_eclipse_swt_widgets_TableItem.test_setText
+ILjava_lang_String(Test_org_eclipse_swt_widgets_TableItem.java:396)
+ at
+org.eclipse.swt.tests.junit.Test_org_eclipse_swt_widgets_TableItem.runTest
+(Test_org_eclipse_swt_widgets_TableItem.java:519)
+ at org.eclipse.swt.tests.junit.AllTests.main(AllTests.java:25)
+4) test_removeII
+(org.eclipse.swt.tests.junit.Test_org_eclipse_swt_widgets_Combo)
+java.lang.IllegalArgumentException: Index out of bounds
+ at org.eclipse.swt.SWT.error(SWT.java:2351)
+ at org.eclipse.swt.SWT.error(SWT.java:2295)
+ at org.eclipse.swt.widgets.Widget.error(Widget.java:375)
+ at org.eclipse.swt.widgets.Combo.remove(Combo.java:938)
+ at
+org.eclipse.swt.tests.junit.Test_org_eclipse_swt_widgets_Combo.test_removeII
+(Test_org_eclipse_swt_widgets_Combo.java:397)
+ at
+org.eclipse.swt.tests.junit.Test_org_eclipse_swt_widgets_Combo.runTest
+(Test_org_eclipse_swt_widgets_Combo.java:688)
+ at org.eclipse.swt.tests.junit.AllTests.main(AllTests.java:25)
+5) test_setItemILjava_lang_String
+(org.eclipse.swt.tests.junit.Test_org_eclipse_swt_widgets_Combo)
+java.lang.ArrayIndexOutOfBoundsException: 0
+ at org.eclipse.swt.widgets.Combo.setItem(Combo.java:1103)
+ at
+org.eclipse.swt.tests.junit.Test_org_eclipse_swt_widgets_Combo.test_setItemILja
+va_lang_String(Test_org_eclipse_swt_widgets_Combo.java:503)
+ at
+org.eclipse.swt.tests.junit.Test_org_eclipse_swt_widgets_Combo.runTest
+(Test_org_eclipse_swt_widgets_Combo.java:695)
+ at org.eclipse.swt.tests.junit.AllTests.main(AllTests.java:25)
+6) test_print
+(org.eclipse.swt.tests.junit.Test_org_eclipse_swt_custom_StyledText)
+java.lang.NullPointerException
+ at org.eclipse.swt.custom.StyledText$Printing.&lt;init&gt;
+(StyledText.java:200)
+ at org.eclipse.swt.custom.StyledText.print(StyledText.java:5933)
+ at
+org.eclipse.swt.tests.junit.Test_org_eclipse_swt_custom_StyledText.test_print
+(Test_org_eclipse_swt_custom_StyledText.java:1690)
+ at
+org.eclipse.swt.tests.junit.Test_org_eclipse_swt_custom_StyledText.runTest
+(Test_org_eclipse_swt_custom_StyledText.java:4165)
+ at org.eclipse.swt.tests.junit.AllTests.main(AllTests.java:25)
+7) test_printLorg_eclipse_swt_printing_Printer
+(org.eclipse.swt.tests.junit.Test_org_eclipse_swt_custom_StyledText)
+java.lang.NullPointerException
+ at org.eclipse.swt.custom.StyledText$Printing.&lt;init&gt;
+(StyledText.java:200)
+ at org.eclipse.swt.custom.StyledText.print(StyledText.java:5988)
+ at org.eclipse.swt.custom.StyledText.print(StyledText.java:5963)
+ at
+org.eclipse.swt.tests.junit.Test_org_eclipse_swt_custom_StyledText.test_printLo
+rg_eclipse_swt_printing_Printer
+(Test_org_eclipse_swt_custom_StyledText.java:1710)
+ at
+org.eclipse.swt.tests.junit.Test_org_eclipse_swt_custom_StyledText.runTest
+(Test_org_eclipse_swt_custom_StyledText.java:4166)
+ at org.eclipse.swt.tests.junit.AllTests.main(AllTests.java:25)
+There were 30 failures:
+1) test_getBoundsI
+(org.eclipse.swt.tests.junit.Test_org_eclipse_swt_widgets_TableItem)
+junit.framework.AssertionFailedError: :a:
+ at
+org.eclipse.swt.tests.junit.Test_org_eclipse_swt_widgets_TableItem.test_getBoun
+dsI(Test_org_eclipse_swt_widgets_TableItem.java:85)
+ at
+org.eclipse.swt.tests.junit.Test_org_eclipse_swt_widgets_TableItem.runTest
+(Test_org_eclipse_swt_widgets_TableItem.java:501)
+ at org.eclipse.swt.tests.junit.AllTests.main(AllTests.java:25)
+2) test_getImageBoundsI
+(org.eclipse.swt.tests.junit.Test_org_eclipse_swt_widgets_TableItem)
+junit.framework.AssertionFailedError: :e:
+ at
+org.eclipse.swt.tests.junit.Test_org_eclipse_swt_widgets_TableItem.test_getImag
+eBoundsI(Test_org_eclipse_swt_widgets_TableItem.java:177)
+ at
+org.eclipse.swt.tests.junit.Test_org_eclipse_swt_widgets_TableItem.runTest
+(Test_org_eclipse_swt_widgets_TableItem.java:506)
+ at org.eclipse.swt.tests.junit.AllTests.main(AllTests.java:25)
+3) test_setImageIndentI
+(org.eclipse.swt.tests.junit.Test_org_eclipse_swt_widgets_TableItem)
+junit.framework.AssertionFailedError: expected:&lt;1&gt; but was:&lt;0&gt;
+ at
+org.eclipse.swt.tests.junit.Test_org_eclipse_swt_widgets_TableItem.test_setImag
+eIndentI(Test_org_eclipse_swt_widgets_TableItem.java:338)
+ at
+org.eclipse.swt.tests.junit.Test_org_eclipse_swt_widgets_TableItem.runTest
+(Test_org_eclipse_swt_widgets_TableItem.java:517)
+ at org.eclipse.swt.tests.junit.AllTests.main(AllTests.java:25)
+4) test_getWidth
+(org.eclipse.swt.tests.junit.Test_org_eclipse_swt_widgets_TableColumn)
+junit.framework.AssertionFailedError: :a: width=0 should be=10
+ at
+org.eclipse.swt.tests.junit.Test_org_eclipse_swt_widgets_TableColumn.test_getWi
+dth(Test_org_eclipse_swt_widgets_TableColumn.java:122)
+ at
+org.eclipse.swt.tests.junit.Test_org_eclipse_swt_widgets_TableColumn.runTest
+(Test_org_eclipse_swt_widgets_TableColumn.java:264)
+ at org.eclipse.swt.tests.junit.AllTests.main(AllTests.java:25)
+5) test_setAlignmentI
+(org.eclipse.swt.tests.junit.Test_org_eclipse_swt_widgets_TableColumn)
+junit.framework.AssertionFailedError: :c: Should not be allowed to set
+alignment of the first column
+ at
+org.eclipse.swt.tests.junit.Test_org_eclipse_swt_widgets_TableColumn.test_setAl
+ignmentI(Test_org_eclipse_swt_widgets_TableColumn.java:177)
+ at
+org.eclipse.swt.tests.junit.Test_org_eclipse_swt_widgets_TableColumn.runTest
+(Test_org_eclipse_swt_widgets_TableColumn.java:268)
+ at org.eclipse.swt.tests.junit.AllTests.main(AllTests.java:25)
+6) test_setDefaultItemLorg_eclipse_swt_widgets_MenuItem
+(org.eclipse.swt.tests.junit.Test_org_eclipse_swt_widgets_Menu)
+junit.framework.AssertionFailedError: expected:&lt;null&gt; but was:&lt;MenuItem {}&gt;
+ at
+org.eclipse.swt.tests.junit.Test_org_eclipse_swt_widgets_Menu.test_setDefaultIt
+emLorg_eclipse_swt_widgets_MenuItem(Test_org_eclipse_swt_widgets_Menu.java:272)
+ at
+org.eclipse.swt.tests.junit.Test_org_eclipse_swt_widgets_Menu.runTest
+(Test_org_eclipse_swt_widgets_Menu.java:387)
+ at org.eclipse.swt.tests.junit.AllTests.main(AllTests.java:25)
+7) test_getMonitor
+(org.eclipse.swt.tests.junit.Test_org_eclipse_swt_widgets_Shell)
+junit.framework.AssertionFailedError
+ at
+org.eclipse.swt.tests.junit.Test_org_eclipse_swt_widgets_Control.test_getMonito
+r(Test_org_eclipse_swt_widgets_Control.java:287)
+ at
+org.eclipse.swt.tests.junit.Test_org_eclipse_swt_widgets_Control.runTest
+(Test_org_eclipse_swt_widgets_Control.java:819)
+ at
+org.eclipse.swt.tests.junit.Test_org_eclipse_swt_widgets_Scrollable.runTest
+(Test_org_eclipse_swt_widgets_Scrollable.java:72)
+ at
+org.eclipse.swt.tests.junit.Test_org_eclipse_swt_widgets_Composite.runTest
+(Test_org_eclipse_swt_widgets_Composite.java:159)
+ at
+org.eclipse.swt.tests.junit.Test_org_eclipse_swt_widgets_Canvas.runTest
+(Test_org_eclipse_swt_widgets_Canvas.java:115)
+ at
+org.eclipse.swt.tests.junit.Test_org_eclipse_swt_widgets_Decorations.runTest
+(Test_org_eclipse_swt_widgets_Decorations.java:250)
+ at
+org.eclipse.swt.tests.junit.Test_org_eclipse_swt_widgets_Shell.runTest
+(Test_org_eclipse_swt_widgets_Shell.java:428)
+ at org.eclipse.swt.tests.junit.AllTests.main(AllTests.java:25)
+8) test_setTopIndexI
+(org.eclipse.swt.tests.junit.Test_org_eclipse_swt_widgets_List)
+junit.framework.AssertionFailedError: expected:&lt;0&gt; but was:&lt;1&gt;
+ at
+org.eclipse.swt.tests.junit.Test_org_eclipse_swt_widgets_List.test_setTopIndexI
+(Test_org_eclipse_swt_widgets_List.java:2019)
+ at
+org.eclipse.swt.tests.junit.Test_org_eclipse_swt_widgets_List.runTest
+(Test_org_eclipse_swt_widgets_List.java:2144)
+ at org.eclipse.swt.tests.junit.AllTests.main(AllTests.java:25)
+9) test_getDoubleClickEnabled
+(org.eclipse.swt.tests.junit.Test_org_eclipse_swt_widgets_Text)
+junit.framework.AssertionFailedError: expected:&lt;false&gt; but was:&lt;true&gt;
+ at
+org.eclipse.swt.tests.junit.Test_org_eclipse_swt_widgets_Text.test_getDoubleCli
+ckEnabled(Test_org_eclipse_swt_widgets_Text.java:316)
+ at
+org.eclipse.swt.tests.junit.Test_org_eclipse_swt_widgets_Text.runTest
+(Test_org_eclipse_swt_widgets_Text.java:953)
+ at org.eclipse.swt.tests.junit.AllTests.main(AllTests.java:25)
+10) test_getTopIndex
+(org.eclipse.swt.tests.junit.Test_org_eclipse_swt_widgets_Text)
+junit.framework.AssertionFailedError: expected:&lt;1&gt; but was:&lt;0&gt;
+ at
+org.eclipse.swt.tests.junit.Test_org_eclipse_swt_widgets_Text.test_getTopIndex
+(Test_org_eclipse_swt_widgets_Text.java:424)
+ at
+org.eclipse.swt.tests.junit.Test_org_eclipse_swt_widgets_Text.runTest
+(Test_org_eclipse_swt_widgets_Text.java:966)
+ at org.eclipse.swt.tests.junit.AllTests.main(AllTests.java:25)
+11) test_setDoubleClickEnabledZ
+(org.eclipse.swt.tests.junit.Test_org_eclipse_swt_widgets_Text)
+junit.framework.AssertionFailedError: expected:&lt;false&gt; but was:&lt;true&gt;
+ at
+org.eclipse.swt.tests.junit.Test_org_eclipse_swt_widgets_Text.test_setDoubleCli
+ckEnabledZ(Test_org_eclipse_swt_widgets_Text.java:599)
+ at
+org.eclipse.swt.tests.junit.Test_org_eclipse_swt_widgets_Text.runTest
+(Test_org_eclipse_swt_widgets_Text.java:974)
+ at org.eclipse.swt.tests.junit.AllTests.main(AllTests.java:25)
+12) test_setTabsI
+(org.eclipse.swt.tests.junit.Test_org_eclipse_swt_widgets_Text)
+junit.framework.AssertionFailedError: expected:&lt;8&gt; but was:&lt;0&gt;
+ at
+org.eclipse.swt.tests.junit.Test_org_eclipse_swt_widgets_Text.test_setTabsI
+(Test_org_eclipse_swt_widgets_Text.java:759)
+ at
+org.eclipse.swt.tests.junit.Test_org_eclipse_swt_widgets_Text.runTest
+(Test_org_eclipse_swt_widgets_Text.java:982)
+ at org.eclipse.swt.tests.junit.AllTests.main(AllTests.java:25)
+13) test_setTopIndexI
+(org.eclipse.swt.tests.junit.Test_org_eclipse_swt_widgets_Text)
+junit.framework.AssertionFailedError: expected:&lt;1&gt; but was:&lt;0&gt;
+ at
+org.eclipse.swt.tests.junit.Test_org_eclipse_swt_widgets_Text.test_setTopIndexI
+(Test_org_eclipse_swt_widgets_Text.java:820)
+ at
+org.eclipse.swt.tests.junit.Test_org_eclipse_swt_widgets_Text.runTest
+(Test_org_eclipse_swt_widgets_Text.java:985)
+ at org.eclipse.swt.tests.junit.AllTests.main(AllTests.java:25)
+14) test_setMaximumI
+(org.eclipse.swt.tests.junit.Test_org_eclipse_swt_widgets_ScrollBar)
+junit.framework.AssertionFailedError: expected:&lt;1&gt; but was:&lt;10&gt;
+ at
+org.eclipse.swt.tests.junit.Test_org_eclipse_swt_widgets_ScrollBar.check
+(Test_org_eclipse_swt_widgets_ScrollBar.java:67)
+ at
+org.eclipse.swt.tests.junit.Test_org_eclipse_swt_widgets_ScrollBar.report
+(Test_org_eclipse_swt_widgets_ScrollBar.java:61)
+ at
+org.eclipse.swt.tests.junit.Test_org_eclipse_swt_widgets_ScrollBar.test_setMaxi
+mumI(Test_org_eclipse_swt_widgets_ScrollBar.java:757)
+ at
+org.eclipse.swt.tests.junit.Test_org_eclipse_swt_widgets_ScrollBar.runTest
+(Test_org_eclipse_swt_widgets_ScrollBar.java:892)
+ at org.eclipse.swt.tests.junit.AllTests.main(AllTests.java:25)
+15) test_setMinimumI
+(org.eclipse.swt.tests.junit.Test_org_eclipse_swt_widgets_ScrollBar)
+junit.framework.AssertionFailedError: expected:&lt;10&gt; but was:&lt;9&gt;
+ at
+org.eclipse.swt.tests.junit.Test_org_eclipse_swt_widgets_ScrollBar.check
+(Test_org_eclipse_swt_widgets_ScrollBar.java:68)
+ at
+org.eclipse.swt.tests.junit.Test_org_eclipse_swt_widgets_ScrollBar.report
+(Test_org_eclipse_swt_widgets_ScrollBar.java:61)
+ at
+org.eclipse.swt.tests.junit.Test_org_eclipse_swt_widgets_ScrollBar.test_setMini
+mumI(Test_org_eclipse_swt_widgets_ScrollBar.java:773)
+ at
+org.eclipse.swt.tests.junit.Test_org_eclipse_swt_widgets_ScrollBar.runTest
+(Test_org_eclipse_swt_widgets_ScrollBar.java:893)
+ at org.eclipse.swt.tests.junit.AllTests.main(AllTests.java:25)
+16) test_setTopItemLorg_eclipse_swt_widgets_TreeItem
+(org.eclipse.swt.tests.junit.Test_org_eclipse_swt_widgets_Tree)
+junit.framework.AssertionFailedError: expected:&lt;TreeItem {}&gt; but was:&lt;null&gt;
+ at
+org.eclipse.swt.tests.junit.Test_org_eclipse_swt_widgets_Tree.test_setTopItemLo
+rg_eclipse_swt_widgets_TreeItem(Test_org_eclipse_swt_widgets_Tree.java:424)
+ at
+org.eclipse.swt.tests.junit.Test_org_eclipse_swt_widgets_Tree.runTest
+(Test_org_eclipse_swt_widgets_Tree.java:538)
+ at org.eclipse.swt.tests.junit.AllTests.main(AllTests.java:25)
+17) test_setSelectionI
+(org.eclipse.swt.tests.junit.Test_org_eclipse_swt_widgets_TabFolder)
+junit.framework.AssertionFailedError: expected:&lt;0&gt; but was:&lt;1&gt;
+ at
+org.eclipse.swt.tests.junit.Test_org_eclipse_swt_widgets_TabFolder.test_setSele
+ctionI(Test_org_eclipse_swt_widgets_TabFolder.java:307)
+ at
+org.eclipse.swt.tests.junit.Test_org_eclipse_swt_widgets_TabFolder.runTest
+(Test_org_eclipse_swt_widgets_TabFolder.java:405)
+ at org.eclipse.swt.tests.junit.AllTests.main(AllTests.java:25)
+18) test_clearSelection
+(org.eclipse.swt.tests.junit.Test_org_eclipse_swt_widgets_Combo)
+junit.framework.AssertionFailedError: :d:
+ at
+org.eclipse.swt.tests.junit.Test_org_eclipse_swt_widgets_Combo.test_clearSelect
+ion(Test_org_eclipse_swt_widgets_Combo.java:130)
+ at
+org.eclipse.swt.tests.junit.Test_org_eclipse_swt_widgets_Combo.runTest
+(Test_org_eclipse_swt_widgets_Combo.java:669)
+ at org.eclipse.swt.tests.junit.AllTests.main(AllTests.java:25)
+19) test_deselectI
+(org.eclipse.swt.tests.junit.Test_org_eclipse_swt_widgets_Combo)
+junit.framework.AssertionFailedError: :b:0
+ at
+org.eclipse.swt.tests.junit.Test_org_eclipse_swt_widgets_Combo.test_deselectI
+(Test_org_eclipse_swt_widgets_Combo.java:155)
+ at
+org.eclipse.swt.tests.junit.Test_org_eclipse_swt_widgets_Combo.runTest
+(Test_org_eclipse_swt_widgets_Combo.java:673)
+ at org.eclipse.swt.tests.junit.AllTests.main(AllTests.java:25)
+20) test_getSelectionIndex
+(org.eclipse.swt.tests.junit.Test_org_eclipse_swt_widgets_Combo)
+junit.framework.AssertionFailedError: expected:&lt;1&gt; but was:&lt;0&gt;
+ at
+org.eclipse.swt.tests.junit.Test_org_eclipse_swt_widgets_Combo.test_getSelectio
+nIndex(Test_org_eclipse_swt_widgets_Combo.java:219)
+ at
+org.eclipse.swt.tests.junit.Test_org_eclipse_swt_widgets_Combo.runTest
+(Test_org_eclipse_swt_widgets_Combo.java:680)
+ at org.eclipse.swt.tests.junit.AllTests.main(AllTests.java:25)
+21) test_removeI
+(org.eclipse.swt.tests.junit.Test_org_eclipse_swt_widgets_Combo)
+junit.framework.AssertionFailedError: index 0 expected:&lt;0&gt; but was:&lt;-1&gt;
+ at
+org.eclipse.swt.tests.junit.Test_org_eclipse_swt_widgets_Combo.test_removeI
+(Test_org_eclipse_swt_widgets_Combo.java:356)
+ at
+org.eclipse.swt.tests.junit.Test_org_eclipse_swt_widgets_Combo.runTest
+(Test_org_eclipse_swt_widgets_Combo.java:687)
+ at org.eclipse.swt.tests.junit.AllTests.main(AllTests.java:25)
+22) test_getRowCount
+(org.eclipse.swt.tests.junit.Test_org_eclipse_swt_widgets_ToolBar)
+junit.framework.AssertionFailedError: :a:1
+ at
+org.eclipse.swt.tests.junit.Test_org_eclipse_swt_widgets_ToolBar.test_getRowCou
+nt(Test_org_eclipse_swt_widgets_ToolBar.java:132)
+ at
+org.eclipse.swt.tests.junit.Test_org_eclipse_swt_widgets_ToolBar.runTest
+(Test_org_eclipse_swt_widgets_ToolBar.java:206)
+ at org.eclipse.swt.tests.junit.AllTests.main(AllTests.java:25)
+23) test_setMaximumI
+(org.eclipse.swt.tests.junit.Test_org_eclipse_swt_widgets_Slider)
+junit.framework.AssertionFailedError: setMaximum(11): Thumb Expected: 1
+Actual: 10
+ at
+org.eclipse.swt.tests.junit.Test_org_eclipse_swt_widgets_Slider.check
+(Test_org_eclipse_swt_widgets_Slider.java:67)
+ at
+org.eclipse.swt.tests.junit.Test_org_eclipse_swt_widgets_Slider.report
+(Test_org_eclipse_swt_widgets_Slider.java:60)
+ at
+org.eclipse.swt.tests.junit.Test_org_eclipse_swt_widgets_Slider.test_setMaximum
+I(Test_org_eclipse_swt_widgets_Slider.java:743)
+ at
+org.eclipse.swt.tests.junit.Test_org_eclipse_swt_widgets_Slider.runTest
+(Test_org_eclipse_swt_widgets_Slider.java:836)
+ at org.eclipse.swt.tests.junit.AllTests.main(AllTests.java:25)
+24) test_setMinimumI
+(org.eclipse.swt.tests.junit.Test_org_eclipse_swt_widgets_Slider)
+junit.framework.AssertionFailedError: setMinimum(91): Thumb Expected: 9
+Actual: 10
+ at
+org.eclipse.swt.tests.junit.Test_org_eclipse_swt_widgets_Slider.check
+(Test_org_eclipse_swt_widgets_Slider.java:67)
+ at
+org.eclipse.swt.tests.junit.Test_org_eclipse_swt_widgets_Slider.report
+(Test_org_eclipse_swt_widgets_Slider.java:60)
+ at
+org.eclipse.swt.tests.junit.Test_org_eclipse_swt_widgets_Slider.test_setMinimum
+I(Test_org_eclipse_swt_widgets_Slider.java:755)
+ at
+org.eclipse.swt.tests.junit.Test_org_eclipse_swt_widgets_Slider.runTest
+(Test_org_eclipse_swt_widgets_Slider.java:837)
+ at org.eclipse.swt.tests.junit.AllTests.main(AllTests.java:25)
+25) test_copy
+(org.eclipse.swt.tests.junit.Test_org_eclipse_swt_custom_StyledText)
+junit.framework.AssertionFailedError: :a:
+ at
+org.eclipse.swt.tests.junit.Test_org_eclipse_swt_custom_StyledText.test_copy
+(Test_org_eclipse_swt_custom_StyledText.java:559)
+ at
+org.eclipse.swt.tests.junit.Test_org_eclipse_swt_custom_StyledText.runTest
+(Test_org_eclipse_swt_custom_StyledText.java:4127)
+ at org.eclipse.swt.tests.junit.AllTests.main(AllTests.java:25)
+26) test_cut
+(org.eclipse.swt.tests.junit.Test_org_eclipse_swt_custom_StyledText)
+junit.framework.AssertionFailedError: :a:
+ at
+org.eclipse.swt.tests.junit.Test_org_eclipse_swt_custom_StyledText.test_cut
+(Test_org_eclipse_swt_custom_StyledText.java:619)
+ at
+org.eclipse.swt.tests.junit.Test_org_eclipse_swt_custom_StyledText.runTest
+(Test_org_eclipse_swt_custom_StyledText.java:4128)
+ at org.eclipse.swt.tests.junit.AllTests.main(AllTests.java:25)
+27) test_getTopIndex
+(org.eclipse.swt.tests.junit.Test_org_eclipse_swt_custom_StyledText)
+junit.framework.AssertionFailedError: :d:
+ at
+org.eclipse.swt.tests.junit.Test_org_eclipse_swt_custom_StyledText.test_getTopI
+ndex(Test_org_eclipse_swt_custom_StyledText.java:1388)
+ at
+org.eclipse.swt.tests.junit.Test_org_eclipse_swt_custom_StyledText.runTest
+(Test_org_eclipse_swt_custom_StyledText.java:4159)
+ at org.eclipse.swt.tests.junit.AllTests.main(AllTests.java:25)
+28) test_invokeActionI
+(org.eclipse.swt.tests.junit.Test_org_eclipse_swt_custom_StyledText)
+junit.framework.ComparisonFailure: expected:&lt;...
+...&gt; but was:&lt;......&gt;
+ at
+org.eclipse.swt.tests.junit.Test_org_eclipse_swt_custom_StyledText.test_invokeA
+ctionI(Test_org_eclipse_swt_custom_StyledText.java:1593)
+ at
+org.eclipse.swt.tests.junit.Test_org_eclipse_swt_custom_StyledText.runTest
+(Test_org_eclipse_swt_custom_StyledText.java:4163)
+ at org.eclipse.swt.tests.junit.AllTests.main(AllTests.java:25)
+29) test_setTopIndexI
+(org.eclipse.swt.tests.junit.Test_org_eclipse_swt_custom_StyledText)
+junit.framework.AssertionFailedError: :e:
+ at
+org.eclipse.swt.tests.junit.Test_org_eclipse_swt_custom_StyledText.test_setTopI
+ndexI(Test_org_eclipse_swt_custom_StyledText.java:3943)
+ at
+org.eclipse.swt.tests.junit.Test_org_eclipse_swt_custom_StyledText.runTest
+(Test_org_eclipse_swt_custom_StyledText.java:4202)
+ at org.eclipse.swt.tests.junit.AllTests.main(AllTests.java:25)
+30) test_setTopPixelI
+(org.eclipse.swt.tests.junit.Test_org_eclipse_swt_custom_StyledText)
+junit.framework.AssertionFailedError: :f:
+ at
+org.eclipse.swt.tests.junit.Test_org_eclipse_swt_custom_StyledText.test_setTopP
+ixelI(Test_org_eclipse_swt_custom_StyledText.java:3972)
+ at
+org.eclipse.swt.tests.junit.Test_org_eclipse_swt_custom_StyledText.runTest
+(Test_org_eclipse_swt_custom_StyledText.java:4203)
+ at org.eclipse.swt.tests.junit.AllTests.main(AllTests.java:25)
+
+FAILURES!!!
+Tests run: 4148, Failures: 30, Errors: 7
+
+
+Calls to warnUnimpl: 958</PRE><BR><I>------- Additional Comment <A
+href="https://bugs.eclipse.org/bugs/show_bug.cgi?id=40152#c1" name=c1>#1</A>
+From <A href="mailto:felipe_heidrich@ca.ibm.com">Felipe Heidrich</A> 2003-07-28
+17:17 ------- </I><PRE>I was able to get rid of the GTK warnings, we still have 2 errors and 28
+Failures.
+</PRE>
+<HR>
+<!-- 1.0@bugzilla.org --><B>Bug List:</B> (18 of 183) <A
+href="https://bugs.eclipse.org/bugs/show_bug.cgi?id=4862">First</A> <A
+href="https://bugs.eclipse.org/bugs/show_bug.cgi?id=79413">Last</A> <A
+href="https://bugs.eclipse.org/bugs/show_bug.cgi?id=40059">Prev</A> <A
+href="https://bugs.eclipse.org/bugs/show_bug.cgi?id=40723">Next</A>
+&nbsp;&nbsp;<A
+href="https://bugs.eclipse.org/bugs/buglist.cgi?regetlastlist=1">Show list</A>
+&nbsp;&nbsp;&nbsp;&nbsp;&nbsp;<A
+href="https://bugs.eclipse.org/bugs/query.cgi">Query page</A>
+&nbsp;&nbsp;&nbsp;&nbsp;&nbsp;<A
+href="https://bugs.eclipse.org/bugs/enter_bug.cgi">Enter new bug</A> <BR><!-- 1.0@bugzilla.org -->
+<TABLE border=0>
+ <TBODY>
+ <TR>
+ <TD vAlign=top bgColor=#000000>
+ <TABLE cellSpacing=0 cellPadding=10 width="100%" bgColor=lightyellow
+ border=0>
+ <TBODY>
+ <TR>
+ <TD>This is <B>Bugzilla</B>: the Mozilla bug system. For more
+ information about what Bugzilla is and what it can do, see <A
+ href="http://www.bugzilla.org/">bugzilla.org</A>. <BR><!-- 1.0@bugzilla.org -->
+ <FORM action=show_bug.cgi method=get>
+ <TABLE width="100%">
+ <TBODY>
+ <TR>
+ <TD>Actions: </TD>
+ <TD vAlign=center noWrap><A
+ href="https://bugs.eclipse.org/bugs/enter_bug.cgi">New</A> |
+ <A href="https://bugs.eclipse.org/bugs/query.cgi">Query</A> | <INPUT type=submit value=Find> bug # <INPUT size=6 name=id> |
+ <A
+ href="https://bugs.eclipse.org/bugs/reports.cgi">Reports</A>
+ </TD>
+ <TD>&nbsp;</TD>
+ <TD vAlign=center align=right><A
+ href="https://bugs.eclipse.org/bugs/createaccount.cgi">New&nbsp;Account</A>
+ | <A
+ href="https://bugs.eclipse.org/bugs/query.cgi?GoAheadAndLogIn=1">Log&nbsp;In</A>
+ </TD></TR></TBODY></TABLE></FORM></TD></TR></TBODY></TABLE></TD></TR></TBODY></TABLE></BODY></HTML>

Back to the top